Home > Failed To > Failed To Notify Build Listener

Failed To Notify Build Listener

Contents

asked 7 months ago viewed 1040 times active 7 months ago Linked 13 build.gradle and project libs 14 Problems trying to create gradle build Related 713Android Studio: Add jar as library?611What Consult IDE log for more details (Help | Show Log) 2016-05-29 15:34:00,683 [ 194002] INFO - ls.idea.gradle.GradleSyncState - Sync with Gradle for project 'IconShowcase' failed: Failed to notify project evaluation listener. Is there any way to take stable Long exposure photos without using Tripod? Jenkins ver. 1.565.2 Jenkins Artifactory Plugin 2.2.4 Gradle Artifactory Plugin 3.0.1 Also, here are the options that we have selected for this plug-in: Project uses the Artifactory Gradle Plugin Capture and this contact form

Show Eyal Ben Moshe added a comment - 08/Oct/14 5:04 PM Hi Alex, Here are a few things that might help us understand the cause of your issue: 1. UP-TO-DATE :validateDebugSigning :packageDebug :zipalignDebug :assembleDebug :cdvBuildDebug BUILD SUCCESSFUL Total time: 1 mins 46.4 secs FAILURE: Build failed with an exception. Here is the code that I added to the build.gradle: // Gradle Artifactory plugin config required for Jenkins Artifactory plugin buildscript { repositories { maven { url 'http://jcenter.bintray.com' } // maven Hot Network Questions Is there a reason why similar or the same musical instruments would develop? https://discuss.gradle.org/t/gradle-2-4-fails-with-failed-to-notify-build-listener-where-gradle-2-3-successfully-builds/9515

Ionic Failed To Notify Build Listener

Browse other questions tagged error-handling gradle or ask your own question. Try to run your build from Jenkins with --debug and --stacktrace to see more information in the build log. 2. Run with --info or --debug option to get more log output. Hello Nobody Logout Sign In or Sign Up (Why?) HomeRefine Search    Messages per Month     Sort by Relevance Date, Forward Date, Backward Start a set with this searchInclude this search in one of

  1. hope that helped.
  2. Kindly help.
  3. Sign in to comment Contact GitHub API Training Shop Blog About © 2017 GitHub, Inc.
  4. That's all.

Not the answer you're looking for? in init.gradle) than an env variable. –Peter Niederwieser Nov 21 '14 at 22:29 Opal - the comment was unintentional. With Gradle 2.3, build works fine The project https://github.com/aim42/htmlSanityCheck(btw planned to be a gradle-plugin, supporting asciidoctor documentation...) thx for your great work! Gradle Failed To Notify Project Evaluation Listener None of these things worked.

How do you express any radical root of a number? Jenkins Failed To Notify Build Listener Welcome, Guest. The closure you give to afterEvaluate() is a callback, and fires even if evaluation failed. https://github.com/phonegap/phonegap-app-desktop/issues/583 How to deal with an intern's lack of basic skills?

You signed in with another tab or window. Gradle Version What does the expression 'seven for seven thirty ' mean? more stack exchange communities company blog Stack Exchange Inbox Reputation and Badges sign up log in tour help Tour Start here for a quick overview of the site Help Center Detailed The cardview and recylcerview are 22.2.1.

Jenkins Failed To Notify Build Listener

Does every data type just boil down to nodes with pointers? https://groups.google.com/forum/#!category-topic/sams-teach-yourself-minecraft-mod-development-in-24-hours/nmZE8DaBlnw BUILD FAILED AttachmentsOptionsSort By NameSort By DateAscendingDescendingThumbnailsListDownload AllAttachmentsbuild.gradle2 kB08/Oct/14 6:16 PMgradle.properties3 kB08/Oct/14 6:16 PMGradle-Output-for-RL-Database-DEV.snapshot-18417 kB08/Oct/14 6:16 PMActivity All Comments History Activity Ascending order - Click to sort in descending order Hide Ionic Failed To Notify Build Listener What time does "by the time" mean? Failed To Notify Build Listener Cordova I'm seeing the following error repeatedly: Failed to notify ProjectEvaluationListener.afterEvaluate(), but primary configuration failure takes precedence.

You need to update all of you plugins, then start from there. weblink more hot questions question feed default about us tour help blog chat data legal privacy policy work here advertising info mobile contact us feedback Technology Life / Arts Culture / Recreation LOG: Caused by: org.gradle.internal.event.ListenerNotificationException: Failed to notify project evaluation listener. Circular Array Rotation When does it make sense to duplicate data for querying What would be your next deduction in this game of Minesweeper? Execution Failed For Task ':predexdebug'.

Jenkins ver. 1.565.2 Artifactory Plugin 2.1.2 Also, here are the options that we have selected for this plug-in: Project uses the Artifactory Gradle Plugin Capture and publish build info Publish artifacts Should we eliminate local variables if we can? Rene (René Groeschke) 2015-05-07 15:40:28 UTC #9 @Gernot_Starke I've figured out what's going wrong with your build. http://1pxcare.com/failed-to/failed-to-build-native-extension-capybara-webkit.html To use Google Groups Discussions, please enable JavaScript in your browser settings, and then refresh this page. .

Updated. –aseolin Aug 5 '15 at 17:26 I was talking about all of your gradle dependencies. –Jared Burrows Aug 5 '15 at 18:44 I'm sorry. Please register or Login to join in on the community! Join them; it only takes a minute: Sign up Failed to notify project evaluation listener on Android gradle up vote 3 down vote favorite I'm trying to add a library to

Jenkins ver. 1.565.2 Jenkins Artifactory Plugin 2.2.4 Gradle Artifactory Plugin 3.0.1 Also, here are the options that we have selected for this plug-in: Project uses the Artifactory Gradle Plugin Capture and

Jenkins ver. 1.565.2 Artifactory Plugin 2.1.2 Also, here are the options that we have selected for this plug-in: Project uses the Artifactory Gradle Plugin Capture and publish build info Publish artifacts Rene (René Groeschke) 2015-05-06 20:47:18 UTC #4 The issue you're seeing comes from the bintray plugin you're using which is not compliant with gradle 2.4. @Luke already provided a fix for Show Eyal Ben Moshe added a comment - 12/Oct/14 9:40 AM Hi Alex, JFrog Support will continue helping you get to a resolution of the issue. Are the following topics usually in an introductory Complex Analysis class: Julia sets, Fatou sets, Mandelbrot set, etc?

What went wrong: Failed to notify build listener. Browse other questions tagged java android android-studio gradle android-gradle or ask your own question. Reload to refresh your session. http://1pxcare.com/failed-to/failed-to-build-sage-entity-interfaces-dll-sage-platform-orm-codegen.html Show Alex Carr added a comment - 08/Oct/14 4:32 PM It appears that the error occurs using Gradle 1.7 with either version of the plug-in.

Personally I would change your buildscript setup to have only one buildscript block on your rootproject. Thanks Member hermwong commented Mar 30, 2016 Great.